Running selftest_1.py causes error: Exception: INTERNAL ADC TEST FAILED VBAT=3.026120v

I tried the selftest_1.py example and received the following error.

Traceback (most recent call last):
File “”, line 75, in
File “”, line 14, in test_int_adc
Exception: INTERNAL ADC TEST FAILED VBAT=3.026120v
MicroPython: v1.18-omv-r6 OpenMV: v4.3.1 HAL: v1.9.0 BOARD: NICLAV-STM32H747

Any ideas on how to fix this issue?

Thank you,
Thane

This is a non-issue. The self-test doesn’t apply for that camera.